{"text_format":"1","workbook":"xlsx","n_sheets":11,"sheets":["Main","EmpiricVANCOMYCINcalc","EmpiricNote","EmpWorksheet","TwoLevelVANCOMYCINcalc","TLKnote","TLKworksheet","EmpiricAMGcalc","AmgEmpWS","DLsheet","WeMadeThis"],"not_rendered":{"charts":5,"images":4,"macros":1,"external_links":0,"defined_names":0,"comments":0,"pivot_tables":0},"unopened":[],"bounds":{"document_bytes":16777216,"sheet_cells":100000,"rows_first":2000,"rows_last":500,"rows_between":2000,"halvings":0,"cell_chars":16384,"cell_head_chars":4096},"cells_cut":0,"cells_raw":0,"read":"whole","date_system":"1900"}

{"sheet":"Main","index":0,"n_rows":40,"n_cols":18,"rows_kept":40,"cut":false,"hidden":false,"merged":[[4,17,5,21],[39,11,40,14],[16,6,20,10],[25,6,29,10],[16,17,20,22],[25,17,29,22]]}
[]
[null,null,null,null,null,null,null,null,null,null,null,null,null,"Clinical calculators are tools used by professionals, in conjunction with clinical judgement, in order to make complex medical decisions"]
[null,null,null,null,null,null,null,null,null,null,null,null,null,"This calculator is not a substitute for advanced knowledge in drug dosing"]
[]
[null,null,null,null,null,null,null,null,null,null,null,null,null,null,null,null,null,"Acknowledgements"]
[]
{"$rows_left_out":35}
{"sheet":"EmpiricVANCOMYCINcalc","index":1,"n_rows":37,"n_cols":25,"rows_kept":37,"cut":false,"hidden":false,"merged":[[15,21,15,25],[9,21,9,25],[10,21,10,25],[11,21,11,25],[12,21,12,25],[2,17,3,23],[0,17,1,23],[4,6,5,12],[9,4,9,5],[10,4,10,5],[4,17,5,23],[8,14,8,25],[17,4,17,5],[18,4,18,5],[19,4,19,5],[8,1,8,7],[12,6,12,7],[13,6,13,7],[11,4,11,5],[12,4,12,5],[13,4,13,5],[15,4,15,5],[14,4,14,5],[16,4,16,5],[15,15,15,18],[17,15,17,18],[14,15,14,18],[18,15,18,18],[16,19,16,20],[16,15,16,18],[15,19,15,20],[17,19,17,20],[14,19,14,20],[18,19,18,20],[13,19,13,20],[12,19,12,20],[9,15,9,18],[10,15,10,18],[11,15,11,18],[13,15,13,18],[12,15,12,18],[9,19,9,20],[10,19,10,20],[11,19,11,20],[30,4,30,5],[20,18,22,25],[24,1,24,7],[24,14,24,20],[32,16,32,20],[25,16,25,18],[26,16,26,18],[27,16,27,18],[28,16,28,18],[29,16,29,18],[30,16,30,18],[25,4,25,5],[26,4,26,5],[27,4,27,5],[28,4,28,5],[29,4,29,5]]}
[null,null,null,null,null,null,null,null,null,null,null,null,null,null,null,null,null,"Reset this Calculator"]
[]
[null,null,null,null,null,null,null,null,null,null,null,null,null,null,null,null,null,"View Patient Note"]
[]
[null,null,null,null,null,null,"Vancomycin Empiric Calculator",null,null,null,null,null,null,null,null,null,null,"Back to Main Menu"]
[]
{"$rows_left_out":32}
{"sheet":"EmpiricNote","index":2,"n_rows":5,"n_cols":11,"rows_kept":5,"cut":false,"hidden":false,"merged":[[1,10,2,16],[4,10,5,16],[1,1,29,1]]}
[]
[null,{"$f":"DLsheet!L53","v":{"$error":"#VALUE!"}},null,null,null,null,null,null,null,null,"Back to Main Menu"]
[]
[]
[null,null,null,null,null,null,null,null,null,null,"Back to Empiric Calculator"]

{"sheet":"EmpWorksheet","index":3,"n_rows":100,"n_cols":33,"rows_kept":100,"cut":false,"hidden":false,"merged":[]}
[{"$f":"EmpiricVANCOMYCINcalc!E27","v":""},{"$f":"EmpiricVANCOMYCINcalc!E26","v":""},8,12,18,24,36,48,null,"Cmax Error","Cmin Error","AUC Error","Total Error","Daily dose","Dose","interval","Usable interval","Infusion","Cmax","Cmin","AUC",null,null,null,"Best","Min",{"$f":"MIN(M2:M46)","v":{"$error":"#VALUE!"}},{"$f":"VLOOKUP(AA1,M:R,3,FALSE)","v":{"$error":"#VALUE!"}},{"$f":"VLOOKUP(AA1,M:R,4,FALSE)","v":{"$error":"#VALUE!"}},{"$f":"VLOOKUP(AA1,M:R,5,FALSE)","v":{"$error":"#VALUE!"}},{"$f":"VLOOKUP(AA1,M:U,7,FALSE)","v":{"$error":"#VALUE!"}},{"$f":"VLOOKUP(AA1,M:U,8,FALSE)","v":{"$error":"#VALUE!"}},{"$f":"VLOOKUP(AA1,M:U,9,FALSE)","v":{"$error":"#VALUE!"}}]
[-0.5,0,0,0,0,0,0,0,null,{"$f":"((S2-EmpiricVANCOMYCINcalc!$T$11)^2)/EmpiricVANCOMYCINcalc!$T$11","v":{"$error":"#VALUE!"}},{"$f":"((T2-EmpiricVANCOMYCINcalc!$T$12)^2)/EmpiricVANCOMYCINcalc!$T$12","v":{"$error":"#VALUE!"}},{"$f":"((U2-EmpiricVANCOMYCINcalc!$T$10)^2)/EmpiricVANCOMYCINcalc!$T$10","v":{"$error":"#VALUE!"}},{"$f":"IF(Q2=\"Yes\",SUM(J2:L2),\"\")","v":{"$error":"#VALUE!"}},{"$f":"O2*24/P2","v":250},500,48,{"$f":"VLOOKUP(P2,DLsheet!$I$15:$J$20,2,FALSE)","v":"Yes"},{"$f":"VLOOKUP(O2,DLsheet!$E$13:$F$21,2,FALSE)","v":0.5},{"$f":"O2/$B$1/(1-EXP(-$A$1*P2))","v":{"$error":"#VALUE!"}},{"$f":"S2*EXP(-$A$1*(P2-R2))","v":{"$error":"#VALUE!"}},{"$f":"O2*24/P2/$B$1/$A$1","v":{"$error":"#VALUE!"}},null,null,null,"2nd Best","Second",{"$f":"SMALL(M2:M46,2)","v":{"$error":"#VALUE!"}},{"$f":"VLOOKUP(AA2,M:R,3,FALSE)","v":{"$error":"#VALUE!"}},{"$f":"VLOOKUP(AA2,M:R,4,FALSE)","v":{"$error":"#VALUE!"}},{"$f":"VLOOKUP(AA2,M:R,5,FALSE)","v":{"$error":"#VALUE!"}},{"$f":"VLOOKUP(AA2,M:U,7,FALSE)","v":{"$error":"#VALUE!"}},{"$f":"VLOOKUP(AA2,M:U,8,FALSE)","v":{"$error":"#VALUE!"}},{"$f":"VLOOKUP(AA2,M:U,9,FALSE)","v":{"$error":"#VALUE!"}}]
[0,{"$f":"HLOOKUP(EmpiricVANCOMYCINcalc!$Q$27,EmpWorksheet!$C$1:$H$100,I3,FALSE)","v":{"$error":"#VALUE!"}},{"$f":"EmpiricVANCOMYCINcalc!Q26/EmpiricVANCOMYCINcalc!E26","v":{"$error":"#VALUE!"}},{"$f":"EmpiricVANCOMYCINcalc!Q26/EmpiricVANCOMYCINcalc!E26","v":{"$error":"#VALUE!"}},{"$f":"EmpiricVANCOMYCINcalc!Q26/EmpiricVANCOMYCINcalc!E26","v":{"$error":"#VALUE!"}},{"$f":"EmpiricVANCOMYCINcalc!Q26/EmpiricVANCOMYCINcalc!E26","v":{"$error":"#VALUE!"}},{"$f":"EmpiricVANCOMYCINcalc!Q26/EmpiricVANCOMYCINcalc!E26","v":{"$error":"#VALUE!"}},{"$f":"EmpiricVANCOMYCINcalc!Q26/EmpiricVANCOMYCINcalc!E26","v":{"$error":"#VALUE!"}},3,{"$f":"((S3-EmpiricVANCOMYCINcalc!$T$11)^2)/EmpiricVANCOMYCINcalc!$T$11","v":{"$error":"#VALUE!"}},{"$f":"((T3-EmpiricVANCOMYCINcalc!$T$12)^2)/EmpiricVANCOMYCINcalc!$T$12","v":{"$error":"#VALUE!"}},{"$f":"((U3-EmpiricVANCOMYCINcalc!$T$10)^2)/EmpiricVANCOMYCINcalc!$T$10","v":{"$error":"#VALUE!"}},{"$f":"IF(Q3=\"Yes\",SUM(J3:L3),\"\")","v":""},333.33333333333331,500,36,{"$f":"VLOOKUP(P3,DLsheet!$I$15:$J$20,2,FALSE)","v":"No"},{"$f":"VLOOKUP(O3,DLsheet!$E$13:$F$21,2,FALSE)","v":0.5},{"$error":"#VALUE!"},{"$error":"#VALUE!"},{"$error":"#VALUE!"},null,null,null,"3rd Best","Third",{"$f":"SMALL(M2:M46,3)","v":{"$error":"#VALUE!"}},{"$f":"VLOOKUP(AA3,M:R,3,FALSE)","v":{"$error":"#VALUE!"}},{"$f":"VLOOKUP(AA3,M:R,4,FALSE)","v":{"$error":"#VALUE!"}},{"$f":"VLOOKUP(AA3,M:R,5,FALSE)","v":{"$error":"#VALUE!"}},{"$f":"VLOOKUP(AA3,M:U,7,FALSE)","v":{"$error":"#VALUE!"}},{"$f":"VLOOKUP(AA3,M:U,8,FALSE)","v":{"$error":"#VALUE!"}},{"$f":"VLOOKUP(AA3,M:U,9,FALSE)","v":{"$error":"#VALUE!"}}]
[0.5,{"$f":"HLOOKUP(EmpiricVANCOMYCINcalc!$Q$27,EmpWorksheet!$C$1:$H$100,I4,FALSE)","v":{"$error":"#VALUE!"}},{"$f":"$C$3*EXP(-$A$1*EmpWorksheet!$A4)","v":{"$error":"#VALUE!"}},{"$f":"$C$3*EXP(-$A$1*EmpWorksheet!$A4)","v":{"$error":"#VALUE!"}},{"$f":"$C$3*EXP(-$A$1*EmpWorksheet!$A4)","v":{"$error":"#VALUE!"}},{"$f":"$C$3*EXP(-$A$1*EmpWorksheet!$A4)","v":{"$error":"#VALUE!"}},{"$f":"$C$3*EXP(-$A$1*EmpWorksheet!$A4)","v":{"$error":"#VALUE!"}},{"$f":"$C$3*EXP(-$A$1*EmpWorksheet!$A4)","v":{"$error":"#VALUE!"}},4,{"$f":"((S4-EmpiricVANCOMYCINcalc!$T$11)^2)/EmpiricVANCOMYCINcalc!$T$11","v":{"$error":"#VALUE!"}},{"$f":"((T4-EmpiricVANCOMYCINcalc!$T$12)^2)/EmpiricVANCOMYCINcalc!$T$12","v":{"$error":"#VALUE!"}},{"$f":"((U4-EmpiricVANCOMYCINcalc!$T$10)^2)/EmpiricVANCOMYCINcalc!$T$10","v":{"$error":"#VALUE!"}},{"$error":"#VALUE!"},375,750,48,{"$f":"VLOOKUP(P4,DLsheet!$I$15:$J$20,2,FALSE)","v":"Yes"},{"$f":"VLOOKUP(O4,DLsheet!$E$13:$F$21,2,FALSE)","v":1},{"$error":"#VALUE!"},{"$error":"#VALUE!"},{"$error":"#VALUE!"}]
[1,{"$f":"HLOOKUP(EmpiricVANCOMYCINcalc!$Q$27,EmpWorksheet!$C$1:$H$100,I5,FALSE)","v":{"$error":"#VALUE!"}},{"$f":"$C$3*EXP(-$A$1*EmpWorksheet!$A5)","v":{"$error":"#VALUE!"}},{"$f":"$C$3*EXP(-$A$1*EmpWorksheet!$A5)","v":{"$error":"#VALUE!"}},{"$f":"$C$3*EXP(-$A$1*EmpWorksheet!$A5)","v":{"$error":"#VALUE!"}},{"$f":"$C$3*EXP(-$A$1*EmpWorksheet!$A5)","v":{"$error":"#VALUE!"}},{"$f":"$C$3*EXP(-$A$1*EmpWorksheet!$A5)","v":{"$error":"#VALUE!"}},{"$f":"$C$3*EXP(-$A$1*EmpWorksheet!$A5)","v":{"$error":"#VALUE!"}},5,{"$f":"((S5-EmpiricVANCOMYCINcalc!$T$11)^2)/EmpiricVANCOMYCINcalc!$T$11","v":{"$error":"#VALUE!"}},{"$f":"((T5-EmpiricVANCOMYCINcalc!$T$12)^2)/EmpiricVANCOMYCINcalc!$T$12","v":{"$error":"#VALUE!"}},{"$f":"((U5-EmpiricVANCOMYCINcalc!$T$10)^2)/EmpiricVANCOMYCINcalc!$T$10","v":{"$error":"#VALUE!"}},{"$error":"#VALUE!"},500,500,24,{"$f":"VLOOKUP(P5,DLsheet!$I$15:$J$20,2,FALSE)","v":"Yes"},{"$f":"VLOOKUP(O5,DLsheet!$E$13:$F$21,2,FALSE)","v":0.5},{"$error":"#VALUE!"},{"$error":"#VALUE!"},{"$error":"#VALUE!"}]
[1.5,{"$f":"HLOOKUP(EmpiricVANCOMYCINcalc!$Q$27,EmpWorksheet!$C$1:$H$100,I6,FALSE)","v":{"$error":"#VALUE!"}},{"$f":"$C$3*EXP(-$A$1*EmpWorksheet!$A6)","v":{"$error":"#VALUE!"}},{"$f":"$C$3*EXP(-$A$1*EmpWorksheet!$A6)","v":{"$error":"#VALUE!"}},{"$f":"$C$3*EXP(-$A$1*EmpWorksheet!$A6)","v":{"$error":"#VALUE!"}},{"$f":"$C$3*EXP(-$A$1*EmpWorksheet!$A6)","v":{"$error":"#VALUE!"}},{"$f":"$C$3*EXP(-$A$1*EmpWorksheet!$A6)","v":{"$error":"#VALUE!"}},{"$f":"$C$3*EXP(-$A$1*EmpWorksheet!$A6)","v":{"$error":"#VALUE!"}},6,{"$f":"((S6-EmpiricVANCOMYCINcalc!$T$11)^2)/EmpiricVANCOMYCINcalc!$T$11","v":{"$error":"#VALUE!"}},{"$f":"((T6-EmpiricVANCOMYCINcalc!$T$12)^2)/EmpiricVANCOMYCINcalc!$T$12","v":{"$error":"#VALUE!"}},{"$f":"((U6-EmpiricVANCOMYCINcalc!$T$10)^2)/EmpiricVANCOMYCINcalc!$T$10","v":{"$error":"#VALUE!"}},"",500,750,36,{"$f":"VLOOKUP(P6,DLsheet!$I$15:$J$20,2,FALSE)","v":"No"},{"$f":"VLOOKUP(O6,DLsheet!$E$13:$F$21,2,FALSE)","v":1},{"$error":"#VALUE!"},{"$error":"#VALUE!"},{"$error":"#VALUE!"}]
{"$rows_left_out":95}
{"sheet":"TwoLevelVANCOMYCINcalc","index":4,"n_rows":34,"n_cols":18,"rows_kept":34,"cut":false,"hidden":false,"merged":[[2,17,3,23],[0,17,1,23],[13,6,13,7],[12,4,12,5],[16,6,16,7],[15,4,15,5],[10,4,10,5],[11,4,11,5],[4,6,5,12],[4,17,5,23],[8,1,8,7],[9,4,9,5],[8,10,8,17],[9,12,9,14],[10,12,10,14],[11,12,11,14],[18,4,18,5],[28,4,29,5],[28,6,29,7],[21,1,21,7],[19,6,19,7],[22,4,22,5],[23,4,23,5],[24,4,24,5],[25,4,25,5],[26,4,26,5],[27,4,27,5],[29,12,29,16],[25,12,25,14],[26,12,26,14],[27,12,27,14],[12,12,12,14],[13,12,13,14],[21,10,21,17],[22,12,22,14],[23,12,23,14],[24,12,24,14],[14,12,14,14],[15,12,15,14]]}
[null,null,null,null,null,null,null,null,null,null,null,null,null,null,null,null,null,"Reset this Calculator"]
[]
[null,null,null,null,null,null,null,null,null,null,null,null,null,null,null,null,null,"View Patient Note"]
[]
[null,null,null,null,null,null,"Vancomycin Two-Level Calculator",null,null,null,null,null,null,null,null,null,null,"Back to Main Menu"]
[]
{"$rows_left_out":29}
{"sheet":"TLKnote","index":5,"n_rows":5,"n_cols":11,"rows_kept":5,"cut":false,"hidden":false,"merged":[[1,10,2,16],[4,10,5,16],[1,1,29,1],[7,10,8,16]]}
[]
[null,{"$f":"DLsheet!V53","v":{"$error":"#VALUE!"}},null,null,null,null,null,null,null,null,"Back to Main Menu"]
[]
[]
[null,null,null,null,null,null,null,null,null,null,"Back to Two-Level Calculator"]

{"sheet":"TLKworksheet","index":6,"n_rows":100,"n_cols":33,"rows_kept":100,"cut":false,"hidden":false,"merged":[]}
[{"$f":"TwoLevelVANCOMYCINcalc!E23","v":""},{"$f":"TwoLevelVANCOMYCINcalc!E27","v":{"$error":"#DIV/0!"}},8,12,18,24,36,48,null,"Cmax Error","Cmin Error","AUC Error","Total Error","Daily dose","Dose","interval","Usable interval","Infusion","Cmax","Cmin","AUC",null,null,null,"Best","Min",{"$f":"MIN(M2:M46)","v":{"$error":"#DIV/0!"}},{"$f":"VLOOKUP(AA1,M:R,3,FALSE)","v":{"$error":"#DIV/0!"}},{"$f":"VLOOKUP(AA1,M:R,4,FALSE)","v":{"$error":"#DIV/0!"}},{"$f":"VLOOKUP(AA1,M:R,5,FALSE)","v":{"$error":"#DIV/0!"}},{"$f":"VLOOKUP(AA1,M:U,7,FALSE)","v":{"$error":"#DIV/0!"}},{"$f":"VLOOKUP(AA1,M:U,8,FALSE)","v":{"$error":"#DIV/0!"}},{"$f":"VLOOKUP(AA1,M:U,9,FALSE)","v":{"$error":"#DIV/0!"}}]
[-0.5,0,0,0,0,0,0,0,null,{"$f":"((S2-TwoLevelVANCOMYCINcalc!$M$11)^2)/TwoLevelVANCOMYCINcalc!$M$11","v":{"$error":"#DIV/0!"}},{"$f":"((T2-TwoLevelVANCOMYCINcalc!$M$12)^2)/TwoLevelVANCOMYCINcalc!$M$12","v":{"$error":"#DIV/0!"}},{"$f":"((U2-TwoLevelVANCOMYCINcalc!$M$10)^2)/TwoLevelVANCOMYCINcalc!$M$10","v":{"$error":"#DIV/0!"}},{"$f":"IF(Q2=\"Yes\",SUM(J2:L2),\"\")","v":{"$error":"#DIV/0!"}},{"$f":"O2*24/P2","v":250},500,48,{"$f":"VLOOKUP(P2,DLsheet!$I$15:$J$20,2,FALSE)","v":"Yes"},{"$f":"VLOOKUP(O2,DLsheet!$E$13:$F$21,2,FALSE)","v":0.5},{"$f":"O2/$B$1/(1-EXP(-$A$1*P2))","v":{"$error":"#DIV/0!"}},{"$f":"S2*EXP(-$A$1*(P2-R2))","v":{"$error":"#DIV/0!"}},{"$f":"O2*24/P2/$B$1/$A$1","v":{"$error":"#DIV/0!"}},null,null,null,"2nd Best","Second",{"$f":"SMALL(M2:M46,2)","v":{"$error":"#DIV/0!"}},{"$f":"VLOOKUP(AA2,M:R,3,FALSE)","v":{"$error":"#DIV/0!"}},{"$f":"VLOOKUP(AA2,M:R,4,FALSE)","v":{"$error":"#DIV/0!"}},{"$f":"VLOOKUP(AA2,M:R,5,FALSE)","v":{"$error":"#DIV/0!"}},{"$f":"VLOOKUP(AA2,M:U,7,FALSE)","v":{"$error":"#DIV/0!"}},{"$f":"VLOOKUP(AA2,M:U,8,FALSE)","v":{"$error":"#DIV/0!"}},{"$f":"VLOOKUP(AA2,M:U,9,FALSE)","v":{"$error":"#DIV/0!"}}]
[0,{"$f":"HLOOKUP(TwoLevelVANCOMYCINcalc!$M$24,TLKworksheet!$C$1:$H$100,I3,FALSE)","v":{"$error":"#DIV/0!"}},{"$f":"TwoLevelVANCOMYCINcalc!M23/TwoLevelVANCOMYCINcalc!E27","v":{"$error":"#DIV/0!"}},{"$f":"TwoLevelVANCOMYCINcalc!M23/TwoLevelVANCOMYCINcalc!E27","v":{"$error":"#DIV/0!"}},{"$f":"TwoLevelVANCOMYCINcalc!M23/TwoLevelVANCOMYCINcalc!E27","v":{"$error":"#DIV/0!"}},{"$f":"TwoLevelVANCOMYCINcalc!M23/TwoLevelVANCOMYCINcalc!E27","v":{"$error":"#DIV/0!"}},{"$f":"TwoLevelVANCOMYCINcalc!M23/TwoLevelVANCOMYCINcalc!E27","v":{"$error":"#DIV/0!"}},{"$f":"TwoLevelVANCOMYCINcalc!M23/TwoLevelVANCOMYCINcalc!E27","v":{"$error":"#DIV/0!"}},3,{"$f":"((S3-TwoLevelVANCOMYCINcalc!$M$11)^2)/TwoLevelVANCOMYCINcalc!$M$11","v":{"$error":"#DIV/0!"}},{"$f":"((T3-TwoLevelVANCOMYCINcalc!$M$12)^2)/TwoLevelVANCOMYCINcalc!$M$12","v":{"$error":"#DIV/0!"}},{"$f":"((U3-TwoLevelVANCOMYCINcalc!$M$10)^2)/TwoLevelVANCOMYCINcalc!$M$10","v":{"$error":"#DIV/0!"}},{"$f":"IF(Q3=\"Yes\",SUM(J3:L3),\"\")","v":""},333.33333333333331,500,36,{"$f":"VLOOKUP(P3,DLsheet!$I$15:$J$20,2,FALSE)","v":"No"},{"$f":"VLOOKUP(O3,DLsheet!$E$13:$F$21,2,FALSE)","v":0.5},{"$error":"#DIV/0!"},{"$error":"#DIV/0!"},{"$error":"#DIV/0!"},null,null,null,"3rd Best","Third",{"$f":"SMALL(M2:M46,3)","v":{"$error":"#DIV/0!"}},{"$f":"VLOOKUP(AA3,M:R,3,FALSE)","v":{"$error":"#DIV/0!"}},{"$f":"VLOOKUP(AA3,M:R,4,FALSE)","v":{"$error":"#DIV/0!"}},{"$f":"VLOOKUP(AA3,M:R,5,FALSE)","v":{"$error":"#DIV/0!"}},{"$f":"VLOOKUP(AA3,M:U,7,FALSE)","v":{"$error":"#DIV/0!"}},{"$f":"VLOOKUP(AA3,M:U,8,FALSE)","v":{"$error":"#DIV/0!"}},{"$f":"VLOOKUP(AA3,M:U,9,FALSE)","v":{"$error":"#DIV/0!"}}]
[0.5,{"$f":"HLOOKUP(TwoLevelVANCOMYCINcalc!$M$24,TLKworksheet!$C$1:$H$100,I4,FALSE)","v":{"$error":"#DIV/0!"}},{"$f":"$C$3*EXP(-$A$1*TLKworksheet!$A4)","v":{"$error":"#DIV/0!"}},{"$f":"$C$3*EXP(-$A$1*TLKworksheet!$A4)","v":{"$error":"#DIV/0!"}},{"$f":"$C$3*EXP(-$A$1*TLKworksheet!$A4)","v":{"$error":"#DIV/0!"}},{"$f":"$C$3*EXP(-$A$1*TLKworksheet!$A4)","v":{"$error":"#DIV/0!"}},{"$f":"$C$3*EXP(-$A$1*TLKworksheet!$A4)","v":{"$error":"#DIV/0!"}},{"$f":"$C$3*EXP(-$A$1*TLKworksheet!$A4)","v":{"$error":"#DIV/0!"}},4,{"$f":"((S4-TwoLevelVANCOMYCINcalc!$M$11)^2)/TwoLevelVANCOMYCINcalc!$M$11","v":{"$error":"#DIV/0!"}},{"$f":"((T4-TwoLevelVANCOMYCINcalc!$M$12)^2)/TwoLevelVANCOMYCINcalc!$M$12","v":{"$error":"#DIV/0!"}},{"$f":"((U4-TwoLevelVANCOMYCINcalc!$M$10)^2)/TwoLevelVANCOMYCINcalc!$M$10","v":{"$error":"#DIV/0!"}},{"$error":"#DIV/0!"},375,750,48,{"$f":"VLOOKUP(P4,DLsheet!$I$15:$J$20,2,FALSE)","v":"Yes"},{"$f":"VLOOKUP(O4,DLsheet!$E$13:$F$21,2,FALSE)","v":1},{"$error":"#DIV/0!"},{"$error":"#DIV/0!"},{"$error":"#DIV/0!"}]
[1,{"$f":"HLOOKUP(TwoLevelVANCOMYCINcalc!$M$24,TLKworksheet!$C$1:$H$100,I5,FALSE)","v":{"$error":"#DIV/0!"}},{"$f":"$C$3*EXP(-$A$1*TLKworksheet!$A5)","v":{"$error":"#DIV/0!"}},{"$f":"$C$3*EXP(-$A$1*TLKworksheet!$A5)","v":{"$error":"#DIV/0!"}},{"$f":"$C$3*EXP(-$A$1*TLKworksheet!$A5)","v":{"$error":"#DIV/0!"}},{"$f":"$C$3*EXP(-$A$1*TLKworksheet!$A5)","v":{"$error":"#DIV/0!"}},{"$f":"$C$3*EXP(-$A$1*TLKworksheet!$A5)","v":{"$error":"#DIV/0!"}},{"$f":"$C$3*EXP(-$A$1*TLKworksheet!$A5)","v":{"$error":"#DIV/0!"}},5,{"$f":"((S5-TwoLevelVANCOMYCINcalc!$M$11)^2)/TwoLevelVANCOMYCINcalc!$M$11","v":{"$error":"#DIV/0!"}},{"$f":"((T5-TwoLevelVANCOMYCINcalc!$M$12)^2)/TwoLevelVANCOMYCINcalc!$M$12","v":{"$error":"#DIV/0!"}},{"$f":"((U5-TwoLevelVANCOMYCINcalc!$M$10)^2)/TwoLevelVANCOMYCINcalc!$M$10","v":{"$error":"#DIV/0!"}},{"$error":"#DIV/0!"},500,500,24,{"$f":"VLOOKUP(P5,DLsheet!$I$15:$J$20,2,FALSE)","v":"Yes"},{"$f":"VLOOKUP(O5,DLsheet!$E$13:$F$21,2,FALSE)","v":0.5},{"$error":"#DIV/0!"},{"$error":"#DIV/0!"},{"$error":"#DIV/0!"}]
[1.5,{"$f":"HLOOKUP(TwoLevelVANCOMYCINcalc!$M$24,TLKworksheet!$C$1:$H$100,I6,FALSE)","v":{"$error":"#DIV/0!"}},{"$f":"$C$3*EXP(-$A$1*TLKworksheet!$A6)","v":{"$error":"#DIV/0!"}},{"$f":"$C$3*EXP(-$A$1*TLKworksheet!$A6)","v":{"$error":"#DIV/0!"}},{"$f":"$C$3*EXP(-$A$1*TLKworksheet!$A6)","v":{"$error":"#DIV/0!"}},{"$f":"$C$3*EXP(-$A$1*TLKworksheet!$A6)","v":{"$error":"#DIV/0!"}},{"$f":"$C$3*EXP(-$A$1*TLKworksheet!$A6)","v":{"$error":"#DIV/0!"}},{"$f":"$C$3*EXP(-$A$1*TLKworksheet!$A6)","v":{"$error":"#DIV/0!"}},6,{"$f":"((S6-TwoLevelVANCOMYCINcalc!$M$11)^2)/TwoLevelVANCOMYCINcalc!$M$11","v":{"$error":"#DIV/0!"}},{"$f":"((T6-TwoLevelVANCOMYCINcalc!$M$12)^2)/TwoLevelVANCOMYCINcalc!$M$12","v":{"$error":"#DIV/0!"}},{"$f":"((U6-TwoLevelVANCOMYCINcalc!$M$10)^2)/TwoLevelVANCOMYCINcalc!$M$10","v":{"$error":"#DIV/0!"}},"",500,750,36,{"$f":"VLOOKUP(P6,DLsheet!$I$15:$J$20,2,FALSE)","v":"No"},{"$f":"VLOOKUP(O6,DLsheet!$E$13:$F$21,2,FALSE)","v":1},{"$error":"#DIV/0!"},{"$error":"#DIV/0!"},{"$error":"#DIV/0!"}]
{"$rows_left_out":95}
{"sheet":"EmpiricAMGcalc","index":7,"n_rows":35,"n_cols":24,"rows_kept":35,"cut":false,"hidden":true,"merged":[[10,4,10,5],[10,15,10,18],[10,19,10,20],[11,4,11,5],[11,15,11,18],[11,19,11,20],[12,4,12,5],[12,6,12,7],[12,15,12,18],[12,19,12,20],[13,4,13,5],[13,6,13,7],[13,15,13,18],[13,19,13,20],[14,4,14,5],[14,15,14,18],[14,19,14,20],[15,4,15,5],[15,15,15,18],[15,19,15,20],[20,18,22,25],[20,4,20,5],[20,6,20,7],[16,4,16,5],[16,15,16,18],[16,19,16,20],[17,4,17,5],[17,15,17,18],[17,19,17,20],[34,9,34,11],[24,9,24,11],[25,9,25,11],[26,9,26,11],[27,9,27,11],[28,9,28,11],[4,17,5,23],[30,9,30,11],[31,9,31,11],[32,9,32,11],[33,9,33,11],[23,6,23,16],[4,6,5,12],[8,1,8,7],[8,15,8,25],[9,4,9,5],[9,15,9,18],[9,19,9,20],[18,4,18,5],[18,15,18,18],[18,19,18,20],[19,4,19,5]]}
[]
[]
[]
[]
[null,null,null,null,null,null,"Aminoglycoside Empiric Calculator",null,null,null,null,null,null,null,null,null,null,"Back to Main Menu"]
[]
{"$rows_left_out":30}
{"sheet":"AmgEmpWS","index":8,"n_rows":100,"n_cols":27,"rows_kept":100,"cut":false,"hidden":true,"merged":[]}
[{"$f":"EmpiricAMGcalc!J26","v":0.16133721566054243},{"$f":"EmpiricAMGcalc!J25","v":31.799999999999997},8,12,18,24,36,48,null,"Cmax Error","Cmin Error","Daily dose","interval","Total Error","Dose","Infusion","Cmax","Cmin","AUC",null,{"$f":"DLsheet!B120","v":0},12,"N2:N19",{"$f":"MIN(INDIRECT(W1))","v":11.237533176954635},{"$f":"VLOOKUP(X1,N:O,2,FALSE)","v":200},{"$f":"VLOOKUP(AA1,V1:Y5,4,FALSE)","v":600},{"$f":"LOOKUP(EmpiricAMGcalc!J29,AmgEmpWS!U1:U5,AmgEmpWS!V1:V5)","v":24}]
[-0.5,0,0,0,0,0,0,0,null,{"$f":"((Q2-EmpiricAMGcalc!$T$11)^2)/EmpiricAMGcalc!$T$11","v":10.494743221542752},{"$f":"((R2-EmpiricAMGcalc!$T$12)^2)/EmpiricAMGcalc!$T$12","v":1.4985775685260854},{"$f":"O2*24/M2","v":300},12,{"$f":"SUM(J2:K2)","v":11.993320790068838},150,0.5,{"$f":"O2/$B$1/(1-EXP(-$A$1*M2))","v":5.5122512297163624},{"$f":"Q2*EXP(-$A$1*(M2-P2))","v":0.8620820142199257},{"$f":"O2*24/M2/$B$1/$A$1","v":58.473565603116882},null,{"$f":"DLsheet!B121","v":7.01},18,"N20:N37",{"$f":"MIN(INDIRECT(W2))","v":2.7457866469852381},{"$f":"VLOOKUP(X2,N:O,2,FALSE)","v":500}]
[0,{"$f":"HLOOKUP(EmpiricAMGcalc!$J$32,AmgEmpWS!$C$1:$H$100,I3,FALSE)","v":18.867924528301888},{"$f":"EmpiricAMGcalc!J31/EmpiricAMGcalc!J25","v":18.867924528301888},{"$f":"EmpiricAMGcalc!J31/EmpiricAMGcalc!J25","v":18.867924528301888},{"$f":"EmpiricAMGcalc!J31/EmpiricAMGcalc!J25","v":18.867924528301888},{"$f":"EmpiricAMGcalc!J31/EmpiricAMGcalc!J25","v":18.867924528301888},{"$f":"EmpiricAMGcalc!J31/EmpiricAMGcalc!J25","v":18.867924528301888},{"$f":"EmpiricAMGcalc!J31/EmpiricAMGcalc!J25","v":18.867924528301888},3,{"$f":"((Q3-EmpiricAMGcalc!$T$11)^2)/EmpiricAMGcalc!$T$11","v":8.001544598046106},{"$f":"((R3-EmpiricAMGcalc!$T$12)^2)/EmpiricAMGcalc!$T$12","v":3.2359885789085299},400,12,11.237533176954635,200,0.5,7.3496683062884829,1.1494426856265676,77.96475413748918,null,{"$f":"DLsheet!B122","v":16.010000000000002},24,"N38:N55",{"$f":"MIN(INDIRECT(W3))","v":0.29898429919185016},{"$f":"VLOOKUP(X3,N:O,2,FALSE)","v":600}]
[0.5,{"$f":"HLOOKUP(EmpiricAMGcalc!$J$32,AmgEmpWS!$C$1:$H$100,I4,FALSE)","v":17.405648110500586},{"$f":"$C$3*EXP(-$A$1*AmgEmpWS!$A4)","v":17.405648110500586},{"$f":"$C$3*EXP(-$A$1*AmgEmpWS!$A4)","v":17.405648110500586},{"$f":"$C$3*EXP(-$A$1*AmgEmpWS!$A4)","v":17.405648110500586},{"$f":"$C$3*EXP(-$A$1*AmgEmpWS!$A4)","v":17.405648110500586},{"$f":"$C$3*EXP(-$A$1*AmgEmpWS!$A4)","v":17.405648110500586},{"$f":"$C$3*EXP(-$A$1*AmgEmpWS!$A4)","v":17.405648110500586},4,{"$f":"((Q4-EmpiricAMGcalc!$T$11)^2)/EmpiricAMGcalc!$T$11","v":5.8459561258773416},{"$f":"((R4-EmpiricAMGcalc!$T$12)^2)/EmpiricAMGcalc!$T$12","v":5.6340088330611806},500,12,11.479964958938522,250,0.5,9.1870853828606034,1.4368033570332093,97.455942671861465,null,{"$f":"DLsheet!B123","v":33.01},36,"N56:N73",{"$f":"MIN(INDIRECT(W4))","v":2.0923012523058726},{"$f":"VLOOKUP(X4,N:O,2,FALSE)","v":500}]
[1,{"$f":"HLOOKUP(EmpiricAMGcalc!$J$32,AmgEmpWS!$C$1:$H$100,I5,FALSE)","v":16.056699065768345},{"$f":"$C$3*EXP(-$A$1*AmgEmpWS!$A5)","v":16.056699065768345},{"$f":"$C$3*EXP(-$A$1*AmgEmpWS!$A5)","v":16.056699065768345},{"$f":"$C$3*EXP(-$A$1*AmgEmpWS!$A5)","v":16.056699065768345},{"$f":"$C$3*EXP(-$A$1*AmgEmpWS!$A5)","v":16.056699065768345},{"$f":"$C$3*EXP(-$A$1*AmgEmpWS!$A5)","v":16.056699065768345},{"$f":"$C$3*EXP(-$A$1*AmgEmpWS!$A5)","v":16.056699065768345},5,{"$f":"((Q5-EmpiricAMGcalc!$T$11)^2)/EmpiricAMGcalc!$T$11","v":4.0279778050364605},{"$f":"((R5-EmpiricAMGcalc!$T$12)^2)/EmpiricAMGcalc!$T$12","v":8.6926383309840443},600,12,12.720616136020505,300,0.5,11.024502459432725,1.7241640284398514,116.94713120623376,null,{"$f":"DLsheet!B124","v":44.01},48,"N74:N91",{"$f":"MIN(INDIRECT(W5))","v":5.7466606582787962},{"$f":"VLOOKUP(X5,N:O,2,FALSE)","v":350}]
[1.5,{"$f":"HLOOKUP(EmpiricAMGcalc!$J$32,AmgEmpWS!$C$1:$H$100,I6,FALSE)","v":14.812294449013269},{"$f":"$C$3*EXP(-$A$1*AmgEmpWS!$A6)","v":14.812294449013269},{"$f":"$C$3*EXP(-$A$1*AmgEmpWS!$A6)","v":14.812294449013269},{"$f":"$C$3*EXP(-$A$1*AmgEmpWS!$A6)","v":14.812294449013269},{"$f":"$C$3*EXP(-$A$1*AmgEmpWS!$A6)","v":14.812294449013269},{"$f":"$C$3*EXP(-$A$1*AmgEmpWS!$A6)","v":14.812294449013269},{"$f":"$C$3*EXP(-$A$1*AmgEmpWS!$A6)","v":14.812294449013269},6,{"$f":"((Q6-EmpiricAMGcalc!$T$11)^2)/EmpiricAMGcalc!$T$11","v":2.5476096355234636},{"$f":"((R6-EmpiricAMGcalc!$T$12)^2)/EmpiricAMGcalc!$T$12","v":12.411877072677113},700,12,14.959486708200576,350,0.5,12.861919536004846,2.0115246998464933,136.43831974060606]
{"$rows_left_out":95}
{"sheet":"DLsheet","index":9,"n_rows":124,"n_cols":22,"rows_kept":124,"cut":false,"hidden":false,"merged":[[52,11,86,15],[52,21,86,27],[4,5,4,7]]}
["Hidden sheet",null,null,null,null,null,null,null,null,"Case-sensitive password for this page:","SIDP",null,null,null,null,null,null,null,null,null,"Yes"]
["Remember to SAVE all work after making edits",null,null,null,null,null,null,null,null,null,null,null,null,null,null,null,null,null,null,null,"No"]
[]
[]
[null,"Gender","SCr Limits","Height Toggle","Weight Toggle","AdjBodyWeightRules",null,null,"CrCl DropDown","Weight DropDown"]
[null,"Male",0.4,"cm","kg","If over by",0.3,{"$f":"1+G6","v":1.3},"CrCl TBW","TBW","First Dose"]
{"$rows_left_out":119}
{"sheet":"WeMadeThis","index":10,"n_rows":39,"n_cols":18,"rows_kept":39,"cut":false,"hidden":false,"merged":[[10,5,11,8],[10,11,11,17],[12,11,12,17],[7,11,8,17],[4,17,5,23],[13,11,13,17],[14,11,14,17],[18,5,19,8],[18,11,19,17],[26,11,27,17],[20,11,20,17],[21,11,21,17],[22,11,22,17],[24,11,24,17],[23,11,23,17],[28,11,28,17],[29,11,29,17],[30,11,30,17],[34,5,35,8],[36,11,36,17],[43,11,43,17],[37,11,37,17],[38,11,38,17],[39,11,39,17],[40,11,40,17],[41,11,41,17],[42,11,42,17]]}
[]
[]
[]
[]
[null,null,null,null,null,null,null,null,null,null,null,null,null,null,null,null,null,"Back to Main Menu"]
[]
{"$rows_left_out":33}